BDBM50379827 CHEMBL2011704
SMILES COc1ccc(cc1)\N=C1/S\C(=C/c2ccc(Oc3ccccc3)cc2)C(=O)N1Cc1ccc(cc1)C(O)=O
InChI Key InChIKey=QKDHZNCZGGNFBK-VFHDLGNDSA-N
Data  4 IC50
  Tab Delimited (TSV)   2D SDfile   Computed 3D by Vconf -m prep SDfile
Find this compound or compounds like it in BindingDB:
Activity Spreadsheet -- Enzyme Inhibition Constant Data from BindingDB
Found 2 hits for monomerid = 50379827
TargetLow molecular weight phosphotyrosine protein phosphatase(Homo sapiens (Human))
University Of Messina
Curated by ChEMBL
LigandPNGBDBM50379827(CHEMBL2011704)
Affinity DataIC50:  1.80E+4nM. Assay description: Competitive inhibition of GST-tagged human recombinant LMW-PTP IF2 expressed in Escherichia coli TB1 using p-nitrophenylphosphate as substrate by Lin...
In DepthDetails ArticlePubMed
TargetLow molecular weight phosphotyrosine protein phosphatase(Homo sapiens (Human))
University Of Messina
Curated by ChEMBL
LigandPNGBDBM50379827(CHEMBL2011704)
Affinity DataIC50:  1.12E+4nM. Assay description: Competitive inhibition of GST-tagged human recombinant LMW-PTP IF1 expressed in Escherichia coli TB1 using p-nitrophenylphosphate as substrate by Lin...
In DepthDetails ArticlePubMed